Target
Muscarinic acetylcholine receptor M1
Ligand
BDBM50003355
Substrate
Meas. Tech.
ChEMBL_138794 (CHEMBL752319)
IC50
6.5±n/a nM
Citation
 Sauerberg, POlesen, PHNielsen, STreppendahl, SSheardown, MJHonoré, TMitch, CHWard, JSPike, AJBymaster, FP Novel functional M1 selective muscarinic agonists. Synthesis and structure-activity relationships of 3-(1,2,5-thiadiazolyl)-1,2,5,6-tetrahydro-1-methylpyridines . J Med Chem 35:2274-83 (1992)  
Target
Name:
Muscarinic acetylcholine receptor M1
Synonyms:
ACM1_RAT Chrm-1 cholinergic receptor, muscarinic 1
Type:
Enzyme Catalytic Domain
Mol. Mass.:
51390.46
Organism:
RAT
Description:
P08482
Residue:
460
  
Inhibitor
Name:
BDBM50003355
Synonyms:
5-(4-Hexylsulfanyl-[1,2,5]thiadiazol-3-yl)-1-methyl-1,2,3,6-tetrahydro-pyridine CHEMBL131819
Type:
Small organic molecule
Emp. Form.:
C14H23N3S2
Mol. Mass.:
297.483
SMILES:
CCCCCCSc1nsnc1C1=CCCN(C)C1
: