Target
Retinoblastoma-associated protein
Ligand
BDBM50251841
Substrate
Meas. Tech.
ChEBML_1684306
IC50
3500±n/a nM
Citation
 Kulkarni, MRMane, MSGhosh, USharma, RLad, NPSrivastava, AKulkarni-Almeida, AKharkar, PSKhedkar, VMPandit, SS Discovery of tetrahydrocarbazoles as dual pERK and pRb inhibitors. Eur J Med Chem 134:366-378 (2017)  
Target
Name:
Retinoblastoma-associated protein
Synonyms:
RB1 Rb pp110 | retinoblastoma
Type:
Other Protein Type
Mol. Mass.:
106170.80
Organism:
Homo sapiens (Human)
Description:
P06400
Residue:
928
  
Inhibitor
Name:
BDBM50251841
Synonyms:
CHEMBL4068198
Type:
Small organic molecule
Emp. Form.:
C21H24N2
Mol. Mass.:
304.4287
SMILES:
Cc1ccc(CNC2CCc3c(C2)n(C)c2ccccc32)cc1
: