Target
G-protein coupled receptor 52
Ligand
BDBM50252137
Substrate
Meas. Tech.
ChEBML_1684383
EC50
3900±n/a nM
Citation
 Tokumaru, KIto, YNomura, INakahata, TShimizu, YKurimoto, EAoyama, KAso, K Design, synthesis, and pharmacological evaluation of 4-azolyl-benzamide derivatives as novel GPR52 agonists. Bioorg Med Chem 25:3098-3115 (2017)  
Target
Name:
G-protein coupled receptor 52
Synonyms:
GPR52 Probable G-protein coupled receptor 52
Type:
PROTEIN
Mol. Mass.:
41366.15
Organism:
Homo sapiens (Human)
Description:
ChEMBL_108391
Residue:
361
  
Inhibitor
Name:
BDBM50252137
Synonyms:
CHEMBL4074656
Type:
Small organic molecule
Emp. Form.:
C19H17ClN2OS
Mol. Mass.:
356.869
SMILES:
Cc1nc(Cc2ccccc2Cl)sc1-c1ccc(C(N)=O)c(C)c1
: