Target
G-protein coupled receptor 52
Ligand
BDBM50252187
Substrate
Meas. Tech.
ChEBML_1684383
EC50
83±n/a nM
Citation
 Tokumaru, KIto, YNomura, INakahata, TShimizu, YKurimoto, EAoyama, KAso, K Design, synthesis, and pharmacological evaluation of 4-azolyl-benzamide derivatives as novel GPR52 agonists. Bioorg Med Chem 25:3098-3115 (2017)  
Target
Name:
G-protein coupled receptor 52
Synonyms:
GPR52 Probable G-protein coupled receptor 52
Type:
PROTEIN
Mol. Mass.:
41366.15
Organism:
Homo sapiens (Human)
Description:
ChEMBL_108391
Residue:
361
  
Inhibitor
Name:
BDBM50252187
Synonyms:
CHEMBL4099668
Type:
Small organic molecule
Emp. Form.:
C21H19F3N2OS
Mol. Mass.:
404.449
SMILES:
CCc1cc(ccc1C(N)=O)-c1sc(Cc2cccc(c2)C(F)(F)F)nc1C
: