Target
Toll-like receptor 9
Ligand
BDBM50252324
Substrate
Meas. Tech.
ChEMBL_1684604 (CHEMBL4035083)
IC50
100±n/a nM
Citation
 Roy, SMukherjee, APaul, BRahaman, ORoy, SMaithri, GRamya, BPal, SGanguly, DTalukdar, A Design and development of benzoxazole derivatives with toll-like receptor 9 antagonism. Eur J Med Chem 134:334-347 (2017)  
Target
Name:
Toll-like receptor 9
Synonyms:
CD_antigen: CD289 TLR9_HUMAN
Type:
Enzyme
Mol. Mass.:
115889.91
Organism:
Homo sapiens (Human)
Description:
Q9NR96
Residue:
1032
  
Inhibitor
Name:
BDBM50252324
Synonyms:
CHEMBL4100138
Type:
Small organic molecule
Emp. Form.:
C32H38N4O2
Mol. Mass.:
510.6697
SMILES:
C(COc1ccc2nc(oc2c1)-c1cccc(NC2CCN(Cc3ccccc3)CC2)c1)CN1CCCC1
: