Target
Gag-Pol polyprotein [489-587]
Ligand
BDBM50006834
Substrate
Meas. Tech.
ChEMBL_159304 (CHEMBL769357)
IC50
295.0±n/a nM
Citation
 Tucker, TJLumma, WCPayne, LSWai, JMde Solms, SJGiuliani, EADarke, PLHeimbach, JCZugay, JASchleif, WA A series of potent HIV-1 protease inhibitors containing a hydroxyethyl secondary amine transition state isostere: synthesis, enzyme inhibition, and antiviral activity. J Med Chem 35:2525-33 (1992)  
Target
Name:
Gag-Pol polyprotein [489-587]
Synonyms:
Human immunodeficiency virus type 1 protease Pol polyprotein | gag-pol
Type:
Enzyme Subunit
Mol. Mass.:
10781.16
Organism:
Human immunodeficiency virus type 1
Description:
P04585[489-587]
Residue:
99
  
Inhibitor
Name:
BDBM50006834
Synonyms:
(1-{1-Benzyl-2-hydroxy-3-[1-(2-hydroxy-indan-1-ylcarbamoyl)-2-phenyl-ethylamino]-propylcarbamoyl}-2-carbamoyl-ethyl)-carbamic acid tert-butyl ester (1.50 hydrate) | CHEMBL309507
Type:
Small organic molecule
Emp. Form.:
C37H47N5O7
Mol. Mass.:
673.7984
SMILES:
CC(C)(C)OC(=O)NC(CC(N)=O)C(=O)N[C@@H](Cc1ccccc1)C(O)CN[C@@H](Cc1ccccc1)C(=O)NC1[C@H](O)Cc2ccccc12
: