Target
Cytochrome P450 1A1
Ligand
BDBM50014323
Substrate
Meas. Tech.
ChEMBL_1684840 (CHEMBL4035319)
IC50
60±n/a nM
Citation
 Dutour, RPoirier, D Inhibitors of cytochrome P450 (CYP) 1B1. Eur J Med Chem 135:296-306 (2017)  
Target
Name:
Cytochrome P450 1A1
Synonyms:
CP1A1_HUMAN CYPIA1 Cytochrome P450 1A1 P450 form 6 P450-P1
Type:
Protein
Mol. Mass.:
58177.23
Organism:
Homo sapiens (Human)
Description:
P04798
Residue:
512
  
Inhibitor
Name:
BDBM50014323
Synonyms:
2-PHENYL-4H-BENZO[H]CHROMEN-4-ONE 7,8-Benzoflavone alpha-naphthoflavone
Type:
Small organic molecule
Emp. Form.:
C19H12O2
Mol. Mass.:
272.2974
SMILES:
O=c1cc(oc2c3ccccc3ccc12)-c1ccccc1
: