Target
C-C chemokine receptor type 5
Ligand
BDBM50252444
Substrate
Meas. Tech.
ChEBML_1684933
EC50
>10.0±n/a nM
Citation
 Thum, SKokornaczyk, AKSeki, TDe Maria, MOrtiz Zacarias, NVde Vries, HWeiss, CKoch, MSchepmann, DKitamura, MTschammer, NHeitman, LHJunker, AWünsch, B Synthesis and biological evaluation of chemokine receptor ligands with 2-benzazepine scaffold. Eur J Med Chem 135:401-413 (2017)  
Target
Name:
C-C chemokine receptor type 5
Synonyms:
C-C CKR-5 CC-CKR-5 CCR5 CCR5_HUMAN CHEMR13 HIV-1 fusion coreceptor
Type:
Enzyme
Mol. Mass.:
40540.21
Organism:
Homo sapiens (Human)
Description:
P51681
Residue:
352
  
Inhibitor
Name:
BDBM50252444
Synonyms:
CHEMBL4095900
Type:
Small organic molecule
Emp. Form.:
C28H34N4O5
Mol. Mass.:
506.5934
SMILES:
CC(C)CN1CC(=Cc2c(cccc2[N+]([O-])=O)C1=O)C(=O)Nc1ccc(CN(C)C2CCOCC2)cc1
: