Target
Serine/threonine-protein kinase PAK 6
Ligand
BDBM4814
Substrate
Meas. Tech.
ChEBML_1685100
Ki
500±n/a nM
Citation
 Guo, JZhu, MWu, THao, CWang, KYan, ZHuang, WWang, JZhao, DCheng, M Discovery of indolin-2-one derivatives as potent PAK4 inhibitors: Structure-activity relationship analysis, biological evaluation and molecular docking study. Bioorg Med Chem 25:3500-3511 (2017)  
Target
Name:
Serine/threonine-protein kinase PAK 6
Synonyms:
PAK5 PAK6_HUMAN Serine/threonine-protein kinase PAK6
Type:
PROTEIN
Mol. Mass.:
74897.61
Organism:
Homo sapiens (Human)
Description:
ChEMBL_1513397
Residue:
681
  
Inhibitor
Name:
BDBM4814
Synonyms:
CHEMBL535 N-[2-(diethylamino)ethyl]-5-{[(3Z)-5-fluoro-2-oxo-2,3-dihydro-1H-indol-3-ylidene]methyl}-2,4-dimethyl-1H-pyrrole-3-carboxamide SUNITINIB US10464902, Sunitinib US9914707, SU11248
Type:
Small organic molecule
Emp. Form.:
C22H27FN4O2
Mol. Mass.:
398.4738
SMILES:
CCN(CC)CCNC(=O)c1c(C)[nH]c(\C=C2/C(=O)Nc3ccc(F)cc23)c1C
: