Target
Kappa-type opioid receptor
Ligand
BDBM50006999
Substrate
Meas. Tech.
ChEMBL_145370 (CHEMBL753138)
IC50
12±n/a nM
Citation
 Freeman, JPMichalson, ETD'Andrea, SVBaczynskyj, LVon Voigtlander, PFLahti, RASmith, MWLawson, CFScahill, TAMizsak, SA Naphtho and benzo analogues of the kappa opioid agonist trans-(+/-)-3,4-dichloro-N-methyl-N-[2-(1-pyrrolidinyl)cyclohexyl] benzeneacetamide. J Med Chem 34:1891-6 (1991)  
Target
Name:
Kappa-type opioid receptor
Synonyms:
KOR-1 OPIATE Kappa Oprk1
Type:
Enzyme
Mol. Mass.:
42656.78
Organism:
Mus musculus (Mouse)
Description:
P33534
Residue:
380
  
Inhibitor
Name:
BDBM50006999
Synonyms:
2-(3,4-Dichloro-phenyl)-N-(2-dimethylamino-1,2,3,4-tetrahydro-naphthalen-1-yl)-N-methyl-acetamide | CHEMBL293273
Type:
Small organic molecule
Emp. Form.:
C21H24Cl2N2O
Mol. Mass.:
391.334
SMILES:
CN(C)[C@@H]1CCc2ccccc2[C@H]1N(C)C(=O)Cc1ccc(Cl)c(Cl)c1
: