Target
Carbonic anhydrase 2
Ligand
BDBM50252996
Substrate
Meas. Tech.
ChEMBL_1685231 (CHEMBL4035710)
Ki
0.660000±n/a nM
Citation
 Alt?ntop, MDSever, BÖzdemir, AKucukoglu, KOnem, HNadaroglu, HKaplanc?kl?, ZA Potential inhibitors of human carbonic anhydrase isozymes I and II: Design, synthesis and docking studies of new 1,3,4-thiadiazole derivatives. Bioorg Med Chem 25:3547-3554 (2017)  
Target
Name:
Carbonic anhydrase 2
Synonyms:
CA-II CAC Carbonate dehydratase II Carbonic anhydrase 2 (CA-II) Carbonic anhydrase C Carbonic anhydrase II (CA-II) Carbonic anhydrase II (hCA II) | Carbonic anhydrase isoenzyme II (hCA II)
Type:
Enzyme
Mol. Mass.:
29250.71
Organism:
Homo sapiens (Human)
Description:
P00918
Residue:
260
  
Inhibitor
Name:
BDBM50252996
Synonyms:
CHEMBL4097972
Type:
Small organic molecule
Emp. Form.:
C21H15Cl2N5O2S2
Mol. Mass.:
504.412
SMILES:
Clc1ccc(-c2ccc(\C=N\NC(=O)CSc3nnc(Nc4ccccc4)s3)o2)c(Cl)c1
: