Target
Carbonic anhydrase 2
Ligand
BDBM50252998
Substrate
Meas. Tech.
ChEMBL_1685228 (CHEMBL4035707)
IC50
0.150000±n/a nM
Citation
 Alt?ntop, MDSever, BÖzdemir, AKucukoglu, KOnem, HNadaroglu, HKaplanc?kl?, ZA Potential inhibitors of human carbonic anhydrase isozymes I and II: Design, synthesis and docking studies of new 1,3,4-thiadiazole derivatives. Bioorg Med Chem 25:3547-3554 (2017)  
Target
Name:
Carbonic anhydrase 2
Synonyms:
CA-II CAC Carbonate dehydratase II Carbonic anhydrase 2 (CA-II) Carbonic anhydrase C Carbonic anhydrase II (CA-II) Carbonic anhydrase II (hCA II) | Carbonic anhydrase isoenzyme II (hCA II)
Type:
Enzyme
Mol. Mass.:
29250.71
Organism:
Homo sapiens (Human)
Description:
P00918
Residue:
260
  
Inhibitor
Name:
BDBM50252998
Synonyms:
CHEMBL4105008
Type:
Small organic molecule
Emp. Form.:
C21H16ClN5O2S2
Mol. Mass.:
469.967
SMILES:
Clc1ccccc1-c1ccc(\C=N\NC(=O)CSc2nnc(Nc3ccccc3)s2)o1
: