Target
Cytosolic endo-beta-N-acetylglucosaminidase
Ligand
BDBM50070208
Substrate
Meas. Tech.
ChEBML_1685304
IC50
24380±n/a nM
Citation
 Bi, YMight, MVankayalapati, HKuberan, B Repurposing of Proton Pump Inhibitors as first identified small molecule inhibitors of endo-?-N-acetylglucosaminidase (ENGase) for the treatment of NGLY1 deficiency, a rare genetic disease. Bioorg Med Chem Lett 27:2962-2966 (2017)  
Target
Name:
Cytosolic endo-beta-N-acetylglucosaminidase
Synonyms:
ENASE_HUMAN Endo-beta-N-acetylglucosaminidase
Type:
PROTEIN
Mol. Mass.:
83989.32
Organism:
Homo sapiens (Human)
Description:
ChEMBL_467019
Residue:
743
  
Inhibitor
Name:
BDBM50070208
Synonyms:
A-65006 CHEBI:6375 Prevacid Prevacid Delayed Release Prevacid iv
Type:
Small organic molecule
Emp. Form.:
C16H14F3N3O2S
Mol. Mass.:
369.361
SMILES:
Cc1c(OCC(F)(F)F)ccnc1C[S+]([O-])c1nc2ccccc2[nH]1
: