Target
Lysine-specific demethylase 5A
Ligand
BDBM281138
Substrate
Meas. Tech.
ChEMBL_1685364 (CHEMBL4035843)
EC50
>30000±n/a nM
Citation
 Liang, JLabadie, SZhang, BOrtwine, DFPatel, SVinogradova, MKiefer, JRMauer, TGehling, VSHarmange, JCCummings, RLai, TLiao, JZheng, XLiu, YGustafson, AVan der Porten, EMao, WLiederer, BMDeshmukh, GAn, LRan, YClasson, MTrojer, PDragovich, PSMurray, L From a novel HTS hit to potent, selective, and orally bioavailable KDM5 inhibitors. Bioorg Med Chem Lett 27:2974-2981 (2017)  
Target
Name:
Lysine-specific demethylase 5A
Synonyms:
Histone demethylase JARID1A Jumonji/ARID domain-containing protein 1A KDM5A_HUMAN RBBP-2 RBP2 | Retinoblastoma-binding protein 2
Type:
Protein
Mol. Mass.:
192091.79
Organism:
Homo sapiens (Human)
Description:
P29375
Residue:
1690
  
Inhibitor
Name:
BDBM281138
Synonyms:
US10022354, Example 78
Type:
Small organic molecule
Emp. Form.:
C21H26N6O
Mol. Mass.:
378.4707
SMILES:
CC(C)c1cc([nH]n1)C(=O)N1CCC(C1)c1cc(cc(C)n1)-c1cnn(C)c1
: