Target
Muscarinic acetylcholine receptor M4
Ligand
BDBM50253106
Substrate
Meas. Tech.
ChEMBL_1685389 (CHEMBL4035868)
EC50
282±n/a nM
Citation
 Tarr, JCWood, MRNoetzel, MJBertron, JLWeiner, RLRodriguez, ALLamsal, AByers, FWChang, SCho, HPJones, CKNiswender, CMWood, MWBrandon, NJDuggan, MEConn, PJBridges, TMLindsley, CW Challenges in the development of an M Bioorg Med Chem Lett 27:2990-2995 (2017)  
Target
Name:
Muscarinic acetylcholine receptor M4
Synonyms:
ACM4_HUMAN Cholinergic, muscarinic M4 Muscarinic acetylcholine receptor M2 and M4
Type:
Enzyme Catalytic Domain
Mol. Mass.:
53079.31
Organism:
Homo sapiens (Human)
Description:
Cholinergic, muscarinic M4 CHRM4 HUMAN M3::P08173
Residue:
479
  
Inhibitor
Name:
BDBM50253106
Synonyms:
CHEMBL4098874
Type:
Small organic molecule
Emp. Form.:
C18H18FN5OS
Mol. Mass.:
371.432
SMILES:
Cc1nnc2sc(C(=O)NC3CN(C3)c3ccc(F)cc3)c(N)c2c1C
: