Target
D(2) dopamine receptor
Ligand
BDBM50007126
Substrate
Meas. Tech.
ChEMBL_62257 (CHEMBL675484)
Ki
8190±n/a nM
Citation
 DeNinno, MPSchoenleber, RPerner, RJLijewski, LAsin, KEBritton, DRMacKenzie, RKebabian, JW Synthesis and dopaminergic activity of 3-substituted 1-(aminomethyl)-3,4-dihydro-5,6-dihydroxy-1H-2-benzopyrans: characterization of an auxiliary binding region in the D1 receptor. J Med Chem 34:2561-9 (1991)  
Target
Name:
D(2) dopamine receptor
Synonyms:
DOPAMINE D2 DOPAMINE D2 Short Dopamine D2 receptor Drd2
Type:
G Protein-Coupled Receptor (GPCR)
Mol. Mass.:
50931.60
Organism:
Rattus norvegicus (rat)
Description:
P61169
Residue:
444
  
Inhibitor
Name:
BDBM50007126
Synonyms:
1-Aminomethyl-3-tert-butyl-isochroman-5,6-diol | CHEMBL82899
Type:
Small organic molecule
Emp. Form.:
C14H21NO3
Mol. Mass.:
251.3214
SMILES:
CC(C)(C)C1Cc2c(O)c(O)ccc2[C@H](CN)O1
: