Target
Cell division cycle 7-related protein kinase/Protein DBF4 homolog A
Ligand
BDBM50253759
Substrate
Meas. Tech.
ChEMBL_1685776 (CHEMBL4036255)
IC50
1.2±n/a nM
Citation
 Kurasawa, OHomma, MOguro, YMiyazaki, TMori, KUchiyama, NIwai, KOhashi, AHara, HYoshida, SCho, N 2-Aminomethylthieno[3,2-d]pyrimidin-4(3H)-ones bearing 3-methylpyrazole hinge binding moiety: Highly potent, selective, and time-dependent inhibitors of Cdc7 kinase. Bioorg Med Chem 25:3658-3670 (2017)  
Target
Name:
Cell division cycle 7-related protein kinase/Protein DBF4 homolog A
Synonyms:
Activator of S phase kinase DBF4/Cell division cycle 7-related protein kinase CDC7/DBF4 (Cell division cycle 7-related protein kinase/Activator of S phase kinase)
Type:
Protein
Mol. Mass.:
Description:
Components:
This complex has 2 components.
Component 1
Name:
Protein DBF4 homolog A
Synonyms:
ASK Chiffon homolog A DBF4-type zinc finger-containing protein 1 DBF4A_HUMAN ZDBF1
Type:
Regulatory subunit
Mol. Mass.:
76869.65
Organism:
Homo sapiens (Human)
Description:
Residue:
674
  
Component 2
Name:
Cell division cycle 7-related protein kinase
Synonyms:
CDC7 CDC7L1 Cell division cycle 7-related protein kinase (CDC7) huCdc7
Type:
Protein
Mol. Mass.:
63908.16
Organism:
Homo sapiens (Human)
Description:
O00311
Residue:
574
  
Inhibitor
Name:
BDBM50253759
Synonyms:
CHEMBL4078941
Type:
Small organic molecule
Emp. Form.:
C16H21Cl2N5OS
Mol. Mass.:
402.342
SMILES:
Cl.Cl.C[C@H]1CCCN1Cc1nc2cc(sc2c(=O)[nH]1)-c1c[nH]nc1C
: