Target
Bromodomain-containing protein 4
Ligand
BDBM19149
Substrate
Meas. Tech.
ChEMBL_1685910 (CHEMBL4036389)
IC50
740±n/a nM
Citation
 Amemiya, SYamaguchi, THashimoto, YNoguchi-Yachide, T Synthesis and evaluation of novel dual BRD4/HDAC inhibitors. Bioorg Med Chem 25:3677-3684 (2017)  
Target
Name:
Bromodomain-containing protein 4
Synonyms:
BRD4 Bromodomain-containing protein 4 (BRD4) Protein HUNK1
Type:
Protein
Mol. Mass.:
152264.84
Organism:
Homo sapiens (Human)
Description:
O60885
Residue:
1362
  
Inhibitor
Name:
BDBM19149
Synonyms:
CHEMBL98 SAHA US10188756, Compound SAHA US11505523, Compound SAHA US9353061, SAHA US9695181, Vorinostat Zolinza suberoylanilide hydroxamic acid
Type:
Small organic molecule
Emp. Form.:
C14H20N2O3
Mol. Mass.:
264.3202
SMILES:
ONC(=O)CCCCCCC(=O)Nc1ccccc1
: