Target
D(2) dopamine receptor
Ligand
BDBM50007397
Substrate
Meas. Tech.
ChEMBL_58714 (CHEMBL671107)
IC50
160±n/a nM
Citation
 Glennon, RAYousif, MYIsmaiel, AMel-Ashmawy, MBHerndon, JLFischer, JBServer, ACHowie, KJ Novel 1-phenylpiperazine and 4-phenylpiperidine derivatives as high-affinity sigma ligands. J Med Chem 34:3360-5 (1992)  
Target
Name:
D(2) dopamine receptor
Synonyms:
DOPAMINE D2 DOPAMINE D2 Short Dopamine D2 receptor Drd2
Type:
G Protein-Coupled Receptor (GPCR)
Mol. Mass.:
50931.60
Organism:
Rattus norvegicus (rat)
Description:
P61169
Residue:
444
  
Inhibitor
Name:
BDBM50007397
Synonyms:
1-(3-Naphthalen-2-yl-propyl)-4-phenyl-piperazine | CHEMBL112037
Type:
Small organic molecule
Emp. Form.:
C23H26N2
Mol. Mass.:
330.4659
SMILES:
C(CN1CCN(CC1)c1ccccc1)Cc1ccc2ccccc2c1
: