Target
Lysosomal acid glucosylceramidase
Ligand
BDBM50358321
Substrate
Meas. Tech.
ChEBML_1686054
Ki
83000±n/a nM
Citation
 Schalli, MWeber, PTysoe, CPabst, BMThonhofer, MPaschke, EStütz, AETschernutter, MWindischhofer, WWithers, SG A new type of pharmacological chaperone for G Bioorg Med Chem Lett 27:3431-3435 (2017)  
Target
Name:
Lysosomal acid glucosylceramidase
Synonyms:
Acid beta-glucosidase Beta-glucocerebrosidase D-glucosyl-N-acylsphingosine glucohydrolase GBA1 GC GLUC Glucosylceramidase (GBA) Glucosylceramidase precursor (Beta-glucocerebrosidase) (Acid beta-glucosidase) (D-glucosyl-N-acylsphingosine glucohydrolase) (Alglucerase) (Imiglucerase) beta-glucocerebrosidase (GCase)
Type:
Enzyme
Mol. Mass.:
59724.64
Organism:
Homo sapiens (Human)
Description:
The beta-Glu activity was measured with commercially available beta-glucocerebrosidase (Ceredase) as the enzyme source.
Residue:
536
  
Inhibitor
Name:
BDBM50358321
Synonyms:
CHEMBL1922579 | CHEMBL1922581
Type:
Small organic molecule
Emp. Form.:
C15H29NO4
Mol. Mass.:
287.3951
SMILES:
CCCCCCCCN[C@@H]1C=C(CO)[C@H](O)[C@H](O)[C@H]1O
: