Target
Nicotinamide phosphoribosyltransferase
Ligand
BDBM81395
Substrate
Meas. Tech.
ChEBML_1686176
Ki
3.0±n/a nM
Citation
 Curtin, MLHeyman, HRClark, RFSorensen, BKDoherty, GAHansen, TMFrey, RRSarris, KAAguirre, ALShrestha, ATu, NWoller, KPliushchev, MASweis, RFCheng, MWilsbacher, JLKovar, PJGuo, JCheng, DLongenecker, KLRaich, DKorepanova, AVSoni, NBAlgire, MARichardson, PLMarin, VLBadagnani, IVasudevan, ABuchanan, FGMaag, DChiang, GGTse, CMichaelides, MR SAR and characterization of non-substrate isoindoline urea inhibitors of nicotinamide phosphoribosyltransferase (NAMPT). Bioorg Med Chem Lett 27:3317-3325 (2017)  
Target
Name:
Nicotinamide phosphoribosyltransferase
Synonyms:
NAMPT NAmPRTase Nicotinamide phosphoribosyltransferase (NAMPT) PBEF1 | Pre-B-cell colony-enhancing factor 1
Type:
Enzyme
Mol. Mass.:
55524.98
Organism:
Homo sapiens (Human)
Description:
P43490
Residue:
491
  
Inhibitor
Name:
BDBM81395
Synonyms:
APO-866
Type:
Small organic molecule
Emp. Form.:
C24H29N3O2
Mol. Mass.:
391.506
SMILES:
O=C(NCCCCC1CCN(CC1)C(=O)c1ccccc1)\C=C\c1cccnc1
: