Target
Nicotinamide phosphoribosyltransferase
Ligand
BDBM50254213
Substrate
Meas. Tech.
ChEBML_1686176
Ki
21±n/a nM
Citation
 Curtin, MLHeyman, HRClark, RFSorensen, BKDoherty, GAHansen, TMFrey, RRSarris, KAAguirre, ALShrestha, ATu, NWoller, KPliushchev, MASweis, RFCheng, MWilsbacher, JLKovar, PJGuo, JCheng, DLongenecker, KLRaich, DKorepanova, AVSoni, NBAlgire, MARichardson, PLMarin, VLBadagnani, IVasudevan, ABuchanan, FGMaag, DChiang, GGTse, CMichaelides, MR SAR and characterization of non-substrate isoindoline urea inhibitors of nicotinamide phosphoribosyltransferase (NAMPT). Bioorg Med Chem Lett 27:3317-3325 (2017)  
Target
Name:
Nicotinamide phosphoribosyltransferase
Synonyms:
NAMPT NAmPRTase Nicotinamide phosphoribosyltransferase (NAMPT) PBEF1 | Pre-B-cell colony-enhancing factor 1
Type:
Enzyme
Mol. Mass.:
55524.98
Organism:
Homo sapiens (Human)
Description:
P43490
Residue:
491
  
Inhibitor
Name:
BDBM50254213
Synonyms:
CHEMBL4076641
Type:
Small organic molecule
Emp. Form.:
C21H18N2O3S
Mol. Mass.:
378.444
SMILES:
O=C(Nc1ccc(cc1)S(=O)(=O)c1ccccc1)N1Cc2ccccc2C1
: