Target
D(2) dopamine receptor
Ligand
BDBM50007550
Substrate
Meas. Tech.
ChEMBL_61135 (CHEMBL670964)
Ki
0.660000±n/a nM
Citation
 Froimowitz, MRämsby, S Conformational properties of semirigid antipsychotic drugs: the pharmacophore for dopamine D-2 antagonist activity. J Med Chem 34:1707-14 (1991)  
Target
Name:
D(2) dopamine receptor
Synonyms:
D(2) dopamine receptor DOPAMINE D2 Long DRD2 Dopamine D2 receptor Dopamine D2 receptor (D2R) Dopamine2-like | d2
Type:
Cell-surface receptors
Mol. Mass.:
50647.10
Organism:
Homo sapiens (Human)
Description:
P14416
Residue:
443
  
Inhibitor
Name:
BDBM50007550
Synonyms:
3'-chlorospiro[2-cyclohexene-1,5'-(10',11'-dihydro-5'H-dibenzo[a,d]cycloheptene)]-4-yl(dimethyl)amine Enantiomer 2'3'-chlorospiro[2-cyclohexene-1,5'-(10',11'-dihydro-5'H-dibenzo[a,d]cycloheptene)]-4-yl(dimethyl)amine
Type:
Small organic molecule
Emp. Form.:
C22H22ClN
Mol. Mass.:
335.87
SMILES:
CN(C)C1CCC2(C=C1)c1ccccc1C=Cc1ccc(Cl)cc21
: