Target
Neuropeptide Y receptor type 2
Ligand
BDBM50254336
Substrate
Meas. Tech.
ChEMBL_1686279 (CHEMBL4036758)
EC50
0.550000±n/a nM
Citation
 Nishizawa, NNiida, AMasuda, YKumano, SYokoyama, KHirabayashi, HAmano, NOhtaki, TAsami, T Antiobesity Effect of a Short-Length Peptide YY Analogue after Continuous Administration in Mice. ACS Med Chem Lett 8:628-631 (2017)  
Target
Name:
Neuropeptide Y receptor type 2
Synonyms:
NPY-Y2 NPY2-R NPY2R_HUMAN Y2 receptor | neuropeptide Y receptor Y2
Type:
Enzyme Catalytic Domain
Mol. Mass.:
42734.65
Organism:
Homo sapiens (Human)
Description:
NPY-Y2 NPY2R HUMAN::P49146
Residue:
381
  
Inhibitor
Name:
BDBM50254336
Synonyms:
CHEMBL4092494
Type:
Small organic molecule
Emp. Form.:
C83H144N28O19
Mol. Mass.:
1838.2077
SMILES:
CC(C)C[C@H](NC(=O)[C@H](CC(N)=O)NC(=O)C(CC1CCCCC1)NC(=O)C(CC1CCCCC1)NC(=O)[C@H](Cc1cnc[nH]1)NC(=O)[C@H](CCCNC(N)=N)NC(=O)C(C)(C)NC(=O)[C@H](CO)NC(C)=O)C(=O)NC(C)(C)C(=O)N[C@@H]([C@@H](C)O)C(=O)N[C@@H](CCCNC(N)=N)C(=O)N[C@@H](CCC(N)=O)C(=O)N[C@@H](CCCNC(N)=N)C(=O)NC(CC1CCCCC1)C(N)=O
: