Target
5-hydroxytryptamine receptor 1A
Ligand
BDBM50007558
Substrate
Meas. Tech.
ChEMBL_837 (CHEMBL615837)
IC50
2.2±n/a nM
Citation
 Lowe, JASeeger, TFNagel, AAHoward, HRSeymour, PAHeym, JHEwing, FENewman, MESchmidt, AWFurman, JS 1-Naphthylpiperazine derivatives as potential atypical antipsychotic agents. J Med Chem 34:1860-6 (1991)  
Target
Name:
5-hydroxytryptamine receptor 1A
Synonyms:
5-HT-1A 5-HT1A 5-hydroxytryptamine receptor 1A (5HT1A) 5ht1a Htr1a Serotonin 1a (5-HT1a) receptor/Adrenergic receptor alpha-1 | Serotonin receptor 1A
Type:
G Protein-Coupled Receptor (GPCR)
Mol. Mass.:
46445.29
Organism:
Rattus norvegicus (rat)
Description:
Binding assays were performed using rat hippocampal membranes.
Residue:
422
  
Inhibitor
Name:
BDBM50007558
Synonyms:
6-[2-(4-Naphthalen-1-yl-piperazin-1-yl)-ethyl]-3H-benzothiazol-2-one | CHEMBL292163
Type:
Small organic molecule
Emp. Form.:
C23H23N3OS
Mol. Mass.:
389.513
SMILES:
O=c1[nH]c2ccc(CCN3CCN(CC3)c3cccc4ccccc34)cc2s1
: