Target
5-hydroxytryptamine receptor 1A
Ligand
BDBM50007695
Substrate
Meas. Tech.
ChEBML_825
IC50
190±n/a nM
Citation
 Cipollina, JARuediger, EHNew, JSWire, MEShepherd, TASmith, DWYevich, JP Synthesis and biological activity of the putative metabolites of the atypical antipsychotic agent tiospirone. J Med Chem 34:3316-28 (1991)  
Target
Name:
5-hydroxytryptamine receptor 1A
Synonyms:
5-HT-1A 5-HT1A 5-hydroxytryptamine receptor 1A (5HT1A) 5ht1a Htr1a Serotonin 1a (5-HT1a) receptor/Adrenergic receptor alpha-1 | Serotonin receptor 1A
Type:
G Protein-Coupled Receptor (GPCR)
Mol. Mass.:
46445.29
Organism:
Rattus norvegicus (rat)
Description:
Binding assays were performed using rat hippocampal membranes.
Residue:
422
  
Inhibitor
Name:
BDBM50007695
Synonyms:
3-Piperazin-1-yl-benzo[d]isothiazole CHEMBL1154 EN300-230853
Type:
Small organic molecule
Emp. Form.:
C11H13N3S
Mol. Mass.:
219.306
SMILES:
C1CN(CCN1)c1nsc2ccccc12
: