Target
Substance-P receptor
Ligand
BDBM50007822
Substrate
Meas. Tech.
ChEMBL_141637 (CHEMBL881816)
EC50
>100±n/a nM
Citation
 Ward, PEwan, GBJordan, CCIreland, SJHagan, RMBrown, JR Potent and highly selective neurokinin antagonists. J Med Chem 33:1848-51 (1990)  
Target
Name:
Substance-P receptor
Synonyms:
NK1R_CAVPO Neurokinin NK1 TACR1
Type:
Enzyme Catalytic Domain
Mol. Mass.:
46261.42
Organism:
GUINEA PIG
Description:
Neurokinin NK1 TACR1 GUINEA PIG::P30547
Residue:
407
  
Inhibitor
Name:
BDBM50007822
Synonyms:
2-(2-{2-[2-(4-Amino-butyrylamino)-3-phenyl-propionylamino]-3-phenyl-propionylamino}-acetylamino)-4-methyl-pentanoic acid [1-carbamoyl-2-(1H-indol-3-yl)-ethyl]-amide | CHEMBL2372954
Type:
Small organic molecule
Emp. Form.:
C41H52N8O6
Mol. Mass.:
752.9016
SMILES:
CC(C)C[C@H](NC(=O)CNC(=O)[C@H](Cc1ccccc1)NC(=O)[C@H](Cc1ccccc1)NC(=O)CCCN)C(=O)N[C@@H](Cc1c[nH]c2ccccc12)C(N)=O
: