Target
Adenosine receptor A1
Ligand
BDBM50004587
Substrate
Meas. Tech.
ChEBML_27567
Ki
82.0±n/a nM
Citation
 Katsushima, TNieves, LWells, JN Structure-activity relationships of 8-cycloalkyl-1,3-dipropylxanthines as antagonists of adenosine receptors. J Med Chem 33:1906-10 (1990)  
Target
Name:
Adenosine receptor A1
Synonyms:
A1 adenosine receptor (hA1) AA1R_HUMAN ADORA1 Adenosine A1-receptor Adenosine receptor A1 (hA1) | Adenosine transporter (AdT)
Type:
G Protein-Coupled Receptor (GPCR)
Mol. Mass.:
36520.92
Organism:
Homo sapiens (Human)
Description:
P30542
Residue:
326
  
Inhibitor
Name:
BDBM50004587
Synonyms:
8-Adamantan-1-yl-1,3-dipropyl-3,7-dihydro-purine-2,6-dione | CHEMBL418101
Type:
Small organic molecule
Emp. Form.:
C21H30N4O2
Mol. Mass.:
370.4885
SMILES:
CCCn1c2nc([nH]c2c(=O)n(CCC)c1=O)C12CC3CC(CC(C3)C1)C2
: