Target
Serine/threonine-protein kinase Chk1
Ligand
BDBM50255144
Substrate
Meas. Tech.
ChEBML_1686958
IC50
35±n/a nM
Citation
 Yang, BVasbinder, MMHird, AWSu, QWang, HYu, YToader, DLyne, PDRead, JABreed, JIoannidis, SDeng, CGrondine, MDeGrace, NWhitston, DBrassil, PJanetka, JW Adventures in Scaffold Morphing: Discovery of Fused Ring Heterocyclic Checkpoint Kinase 1 (CHK1) Inhibitors. J Med Chem 61:1061-1073 (2018)  
Target
Name:
Serine/threonine-protein kinase Chk1
Synonyms:
CHEK1 CHK1 checkpoint homolog Checkpoint kinase-1 (CHK1)
Type:
Enzyme Catalytic Domain
Mol. Mass.:
54443.02
Organism:
Homo sapiens (Human)
Description:
gi_166295192
Residue:
476
  
Inhibitor
Name:
BDBM50255144
Synonyms:
CHEMBL4079391
Type:
Small organic molecule
Emp. Form.:
C21H24N4OS
Mol. Mass.:
380.506
SMILES:
CCN([C@H]1CCCNC1)c1ncc(C(N)=O)c2sc(cc12)-c1ccccc1
: