Target
C-C chemokine receptor type 5
Ligand
BDBM50255479
Substrate
Meas. Tech.
ChEMBL_1687084 (CHEMBL4037563)
EC50
>10000±n/a nM
Citation
 Lu, HYang, TXu, ZLin, XDing, QZhang, YCai, XDong, KGong, SZhang, WPatel, MCopley, RCBXiang, JGuan, XWren, PRen, F Discovery of Novel 1-Cyclopentenyl-3-phenylureas as Selective, Brain Penetrant, and Orally Bioavailable CXCR2 Antagonists. J Med Chem 61:2518-2532 (2018)  
Target
Name:
C-C chemokine receptor type 5
Synonyms:
C-C CKR-5 CC-CKR-5 CCR5 CCR5_HUMAN CHEMR13 HIV-1 fusion coreceptor
Type:
Enzyme
Mol. Mass.:
40540.21
Organism:
Homo sapiens (Human)
Description:
P51681
Residue:
352
  
Inhibitor
Name:
BDBM50255479
Synonyms:
CHEMBL4067429
Type:
Small organic molecule
Emp. Form.:
C18H23ClN2O5S
Mol. Mass.:
414.904
SMILES:
CC1=CCC[C@H]1NC(=O)Nc1ccc(Cl)c(c1O)S(=O)(=O)[C@@]1(C)CCOC1
: