Target
Gonadotropin-releasing hormone receptor
Ligand
BDBM50007949
Substrate
Meas. Tech.
ChEBML_71439
Kd
1.3±n/a nM
Citation
 Theobald, PPorter, JRivier, CCorrigan, AHook, WSiraganian, RPerrin, MVale, WRivier, J Novel gonadotropin-releasing hormone antagonists: peptides incorporating modified N omega-cyanoguanidino moieties. J Med Chem 34:2395-402 (1991)  
Target
Name:
Gonadotropin-releasing hormone receptor
Synonyms:
GNRHR_RAT GnRH-R | Gnrhr
Type:
PROTEIN
Mol. Mass.:
37767.60
Organism:
Rattus norvegicus
Description:
ChEMBL_1335047
Residue:
327
  
Inhibitor
Name:
BDBM50007949
Synonyms:
CHEMBL411586 | pGlu-His-Trp-Ser-Har(bCN)-DHar(bCN)-Leu-ILys-Pro-DAla-NH2
Type:
Small organic molecule
Emp. Form.:
C72H113N23O12
Mol. Mass.:
1492.8145
SMILES:
CCCCNC(NCCCC[C@H](NC(=O)[C@H](CO)NC(=O)[C@H](Cc1c[nH]c2ccccc12)NC(=O)[C@H](Cc1cnc[nH]1)NC(=O)[C@@H]1CCC(=O)N1)C(=O)N[C@H](CCCCNC(NCCCC)=NC#N)C(=O)N[C@@H](CC(C)C)C(=O)N[C@@H](CCCCNC(C)C)C(=O)N1CCC[C@H]1C(=O)N[C@H](C)C(N)=O)=NC#N
: