Target
Reverse transcriptase/RNaseH
Ligand
BDBM50004152
Substrate
Meas. Tech.
ChEMBL_196945 (CHEMBL801137)
IC50
17500±n/a nM
Citation
 Goudgaon, NMSchinazi, RF Activity of acyclic 6-(phenylselenenyl)pyrimidine nucleosides against human immunodeficiency viruses in primary lymphocytes. J Med Chem 34:3305-9 (1991)  
Target
Name:
Reverse transcriptase/RNaseH
Synonyms:
HIV-1 Reverse Transcriptase RNase H Reverse transcriptase/RNaseH
Type:
PROTEIN
Mol. Mass.:
65229.15
Organism:
Human immunodeficiency virus 1
Description:
ChEMBL_1473730
Residue:
566
  
Inhibitor
Name:
BDBM50004152
Synonyms:
(HEPT) 1-(2-Hydroxy-ethoxymethyl)-5-methyl-6-phenylsulfanyl-1H-pyrimidine-2,4-dione 1-(2-HYDROXYETHYLOXYMETHYL)-6-PHENYL THIOTHYMINE 1-(2-Hydroxy-ethoxymethyl)-5-methyl-6-phenylsulfanyl-1H-pyrimidine-2,4-dione(HEPT) 1-[(2-hydroxyethoxy)methyl]-6-(phenylthio)-thymine | CHEMBL31871
Type:
Small organic molecule
Emp. Form.:
C14H16N2O4S
Mol. Mass.:
308.353
SMILES:
Cc1c(Sc2ccccc2)n(COCCO)c(=O)[nH]c1=O
: