Target
Kallikrein-2
Ligand
BDBM50256260
Substrate
Meas. Tech.
ChEBML_1687660
Ki
10000±n/a nM
Citation
 Teufel, DPBennett, GHarrison, Hvan Rietschoten, KPavan, SStace, CLe Floch, FVan Bergen, TVermassen, EBarbeaux, PHu, TTFeyen, JHMVanhove, M Stable and Long-Lasting, Novel Bicyclic Peptide Plasma Kallikrein Inhibitors for the Treatment of Diabetic Macular Edema. J Med Chem 61:2823-2836 (2018)  
Target
Name:
Kallikrein-2
Synonyms:
Glandular kallikrein-1 KLK2_HUMAN Kallikrein-2 hGK-1
Type:
PROTEIN
Mol. Mass.:
28673.68
Organism:
Homo sapiens (Human)
Description:
ChEMBL_862797
Residue:
261
  
Inhibitor
Name:
BDBM50256260
Synonyms:
CHEMBL4094403
Type:
Small organic molecule
Emp. Form.:
C76H105N19O19S3
Mol. Mass.:
1684.958
SMILES:
CC(C)C[C@@H]1NC(=O)[C@H](CC(O)=O)NC(=O)[C@H](CCC(N)=O)NC(=O)[C@H](Cc2cnc[nH]2)NC[C@H](C)NC(=O)[C@H]2CSCc3cc(CSC[C@H](NC1=O)C(O)=O)cc(CSC[C@H](NC(C)=O)C(=O)N[C@@H](CO)C(=O)N[C@@H](Cc1ccccc1)C(=O)N1CCC1C(=O)N[C@@H](Cc1ccc(O)cc1)C(=O)N[C@@H](CCCCNC(N)=N)C(=O)N2)c3
: