Target
Plasma kallikrein
Ligand
BDBM50256276
Substrate
Meas. Tech.
ChEMBL_1687646 (CHEMBL4038125)
Ki
0.390000±n/a nM
Citation
 Teufel, DPBennett, GHarrison, Hvan Rietschoten, KPavan, SStace, CLe Floch, FVan Bergen, TVermassen, EBarbeaux, PHu, TTFeyen, JHMVanhove, M Stable and Long-Lasting, Novel Bicyclic Peptide Plasma Kallikrein Inhibitors for the Treatment of Diabetic Macular Edema. J Med Chem 61:2823-2836 (2018)  
Target
Name:
Plasma kallikrein
Synonyms:
Fletcher factor KLKB1 Kallikrein Plasma kallikrein heavy chain Plasma prekallikrein
Type:
Protein
Mol. Mass.:
71391.16
Organism:
Homo sapiens (Human)
Description:
P03952
Residue:
638
  
Inhibitor
Name:
BDBM50256276
Synonyms:
CHEMBL4079260
Type:
Small organic molecule
Emp. Form.:
C79H109N19O20S3
Mol. Mass.:
1741.021
SMILES:
CC(C)C[C@@H]1NC(=O)[C@H](CC(O)=O)NC(=O)[C@H](CCC(N)=O)NC(=O)[C@H](Cc2cnc[nH]2)NC(=O)[C@H](CC(C)C)NC(=O)[C@@H]2CSCc3cc(CSC[C@H](NC1=O)C(O)=O)cc(CSC[C@H](NC(C)=O)C(=O)N[C@@H](CO)C(=O)N[C@@H](Cc1ccccc1)C(=O)N1CCC[C@H]1C(=O)N[C@@H](Cc1ccc(O)cc1)C(=O)N[C@@H](CCCNC(N)=N)C(=O)N2)c3
: