Target
Protein polybromo-1
Ligand
BDBM342597
Substrate
Meas. Tech.
ChEBML_1687848
IC50
>10000±n/a nM
Citation
 Hasvold, LASheppard, GSWang, LFidanze, SDLiu, DPratt, JKMantei, RAWada, CKHubbard, RShen, YLin, XHuang, XWarder, SEWilcox, DLi, LBuchanan, FGSmithee, LAlbert, DHMagoc, TJPark, CHPetros, AMPanchal, SCSun, CKovar, PSoni, NBElmore, SWKati, WMMcDaniel, KF Methylpyrrole inhibitors of BET bromodomains. Bioorg Med Chem Lett 27:2225-2233 (2017)  
Target
Name:
Protein polybromo-1
Synonyms:
BAF180 PB1 PBRM1 hPB1
Type:
PROTEIN
Mol. Mass.:
192953.62
Organism:
Homo sapiens (Human)
Description:
ChEMBL_104264
Residue:
1689
  
Inhibitor
Name:
BDBM342597
Synonyms:
N-[3-(3-methyl-4-oxo-4,5,6,7-tetrahydro-2H-isoindol-1-yl)-4-phenoxyphenyl]methanesulfonamide | US9776990, Example 40
Type:
Small organic molecule
Emp. Form.:
C22H22N2O4S
Mol. Mass.:
410.486
SMILES:
Cc1[nH]c(c2CCCC(=O)c12)-c1cc(NS(C)(=O)=O)ccc1Oc1ccccc1
: