Target
E3 ubiquitin-protein ligase TRIM33
Ligand
BDBM342597
Substrate
Meas. Tech.
ChEBML_1687850
IC50
>10000±n/a nM
Citation
 Hasvold, LASheppard, GSWang, LFidanze, SDLiu, DPratt, JKMantei, RAWada, CKHubbard, RShen, YLin, XHuang, XWarder, SEWilcox, DLi, LBuchanan, FGSmithee, LAlbert, DHMagoc, TJPark, CHPetros, AMPanchal, SCSun, CKovar, PSoni, NBElmore, SWKati, WMMcDaniel, KF Methylpyrrole inhibitors of BET bromodomains. Bioorg Med Chem Lett 27:2225-2233 (2017)  
Target
Name:
E3 ubiquitin-protein ligase TRIM33
Synonyms:
6.3.2.- Ectodermin homolog KIAA1113 RET-fused gene 7 protein TIF1-gamma TRI33_HUMAN Transcription intermediary factor 1-gamma | Tripartite motif-containing protein 33
Type:
PROTEIN
Mol. Mass.:
122534.89
Organism:
Homo sapiens (Human)
Description:
ChEMBL_105347
Residue:
1127
  
Inhibitor
Name:
BDBM342597
Synonyms:
N-[3-(3-methyl-4-oxo-4,5,6,7-tetrahydro-2H-isoindol-1-yl)-4-phenoxyphenyl]methanesulfonamide | US9776990, Example 40
Type:
Small organic molecule
Emp. Form.:
C22H22N2O4S
Mol. Mass.:
410.486
SMILES:
Cc1[nH]c(c2CCCC(=O)c12)-c1cc(NS(C)(=O)=O)ccc1Oc1ccccc1
: