Target
Bromodomain-containing protein 3
Ligand
BDBM50256397
Substrate
Meas. Tech.
ChEBML_1687853
Ki
290±n/a nM
Citation
 Hasvold, LASheppard, GSWang, LFidanze, SDLiu, DPratt, JKMantei, RAWada, CKHubbard, RShen, YLin, XHuang, XWarder, SEWilcox, DLi, LBuchanan, FGSmithee, LAlbert, DHMagoc, TJPark, CHPetros, AMPanchal, SCSun, CKovar, PSoni, NBElmore, SWKati, WMMcDaniel, KF Methylpyrrole inhibitors of BET bromodomains. Bioorg Med Chem Lett 27:2225-2233 (2017)  
Target
Name:
Bromodomain-containing protein 3
Synonyms:
BRD3 Bromodomain and extra-terminal motif (BET) Bromodomain-containing protein 3 (BRD3) RING3-like protein | RING3L
Type:
Protein
Mol. Mass.:
79571.81
Organism:
Homo sapiens (Human)
Description:
Q15059
Residue:
726
  
Inhibitor
Name:
BDBM50256397
Synonyms:
CHEMBL4088466
Type:
Small organic molecule
Emp. Form.:
C21H16F2N2O4S
Mol. Mass.:
430.425
SMILES:
Cn1cc(-c2cc(ccc2Oc2ccc(F)cc2F)S(C)(=O)=O)c2cc[nH]c(=O)c12
: