Target
Protein polybromo-1
Ligand
BDBM50158624
Substrate
Meas. Tech.
ChEBML_1687848
IC50
>10000±n/a nM
Citation
 Hasvold, LASheppard, GSWang, LFidanze, SDLiu, DPratt, JKMantei, RAWada, CKHubbard, RShen, YLin, XHuang, XWarder, SEWilcox, DLi, LBuchanan, FGSmithee, LAlbert, DHMagoc, TJPark, CHPetros, AMPanchal, SCSun, CKovar, PSoni, NBElmore, SWKati, WMMcDaniel, KF Methylpyrrole inhibitors of BET bromodomains. Bioorg Med Chem Lett 27:2225-2233 (2017)  
Target
Name:
Protein polybromo-1
Synonyms:
BAF180 PB1 PBRM1 hPB1
Type:
PROTEIN
Mol. Mass.:
192953.62
Organism:
Homo sapiens (Human)
Description:
ChEMBL_104264
Residue:
1689
  
Inhibitor
Name:
BDBM50158624
Synonyms:
CHEMBL3786012
Type:
Small organic molecule
Emp. Form.:
C21H18F2N2O4S
Mol. Mass.:
432.44
SMILES:
Cc1[nH]c(c2CCNC(=O)c12)-c1cc(ccc1Oc1ccc(F)cc1F)S(C)(=O)=O
: