Target
Kappa-type opioid receptor
Ligand
BDBM21130
Substrate
Meas. Tech.
ChEBML_1688147
Ki
4.0±n/a nM
Citation
 Truong, PMHassan, SALee, YSKopajtic, TAKatz, JLChadderdon, AMTraynor, JRDeschamps, JRJacobson, AERice, KC Modulation of opioid receptor affinity and efficacy via N-substitution of 9?-hydroxy-5-(3-hydroxyphenyl)morphan: Synthesis and computer simulation study. Bioorg Med Chem 25:2406-2422 (2017)  
Target
Name:
Kappa-type opioid receptor
Synonyms:
KOR-1 OPIATE Kappa Opioid receptor Ror-d
Type:
G Protein-Coupled Receptor (GPCR)
Mol. Mass.:
42692.90
Organism:
Rattus norvegicus (rat)
Description:
P34975
Residue:
380
  
Inhibitor
Name:
BDBM21130
Synonyms:
N-methyl-2-phenyl-N-[(5R,7S,8S)-7-(pyrrolidin-1-yl)-1-oxaspiro[4.5]decan-8-yl]acetamide U-69593 [3H]U69593
Type:
radiolabeled ligand
Emp. Form.:
C22H32N2O2
Mol. Mass.:
356.5017
SMILES:
CN([C@H]1CC[C@@]2(CCCO2)C[C@@H]1N1CCCC1)C(=O)Cc1ccccc1
: