Target
Adenosylhomocysteinase
Ligand
BDBM50230013
Substrate
Meas. Tech.
ChEBML_196872
IC50
>37700±n/a nM
Citation
 Shuto, SObara, TToriya, MHosoya, MSnoeck, RAndrei, GBalzarini, JDe Clercq, E New neplanocin analogues. 1. Synthesis of 6'-modified neplanocin A derivatives as broad-spectrum antiviral agents. J Med Chem 35:324-31 (1992)  
Target
Name:
Adenosylhomocysteinase
Synonyms:
AHCY SAHH | SAHH_HUMAN
Type:
PROTEIN
Mol. Mass.:
47714.06
Organism:
Homo sapiens (Human)
Description:
ChEMBL_1507791
Residue:
432
  
Inhibitor
Name:
BDBM50230013
Synonyms:
CHEMBL109444
Type:
Small organic molecule
Emp. Form.:
C11H12FN5O2
Mol. Mass.:
265.2437
SMILES:
Nc1ncnc2n(cnc12)[C@@H]1C=C(CF)[C@@H](O)[C@H]1O
: