Target
Aldo-keto reductase family 1 member B1
Ligand
BDBM50008480
Substrate
Meas. Tech.
ChEBML_31764
IC50
6.5±n/a nM
Citation
 Mylari, BLBeyer, TAScott, PJAldinger, CEDee, MFSiegel, TWZembrowski, WJ Potent, orally active aldose reductase inhibitors related to zopolrestat: surrogates for benzothiazole side chain. J Med Chem 35:457-65 (1992)  
Target
Name:
Aldo-keto reductase family 1 member B1
Synonyms:
AKR1B1 ALDR_HUMAN AR Aldose Reductase (ALR2) Aldose reductase (AR)
Type:
Protein
Mol. Mass.:
35855.50
Organism:
Homo sapiens (Human)
Description:
P15121. 4LAU; 2IKI; 4LB4; 2FZD; 2FZ8; 1US0
Residue:
316
  
Inhibitor
Name:
BDBM50008480
Synonyms:
CHEMBL341864 | {3-[3-(2-Bromo-phenyl)-[1,2,4]oxadiazol-5-ylmethyl]-4-oxo-3,4-dihydro-phthalazin-1-yl}-acetic acid
Type:
Small organic molecule
Emp. Form.:
C19H13BrN4O4
Mol. Mass.:
441.235
SMILES:
OC(=O)Cc1nn(Cc2nc(no2)-c2ccccc2Br)c(=O)c2ccccc12
: