Target
Metabotropic glutamate receptor 2
Ligand
BDBM50257606
Substrate
Meas. Tech.
ChEMBL_1689937 (CHEMBL4040507)
Kd
1.2±n/a nM
Citation
 Doornbos, MLJCid, JMHaubrich, JNunes, Avan de Sande, JWVermond, SCMulder-Krieger, TTrabanco, AAAhnaou, ADrinkenburg, WHLavreysen, HHeitman, LHIJzerman, APTresadern, G Discovery and Kinetic Profiling of 7-Aryl-1,2,4-triazolo[4,3-a]pyridines: Positive Allosteric Modulators of the Metabotropic Glutamate Receptor 2. J Med Chem 60:6704-6720 (2017)  
Target
Name:
Metabotropic glutamate receptor 2
Synonyms:
GPRC1B GRM2_HUMAN Metabotropic glutamate receptor mGlu2 | metabotropic glutamate 2
Type:
Enzyme
Mol. Mass.:
95584.88
Organism:
Homo sapiens (Human)
Description:
Q14416
Residue:
872
  
Inhibitor
Name:
BDBM50257606
Synonyms:
CHEMBL4073628
Type:
Small organic molecule
Emp. Form.:
C20H18ClF3N4
Mol. Mass.:
406.832
SMILES:
FC(F)(F)c1c(ccn2c(CC3CC3)nnc12)-c1ccc(NC2CC2)c(Cl)c1
: