Target
Metabotropic glutamate receptor 2
Ligand
BDBM50257560
Substrate
Meas. Tech.
ChEMBL_1689937 (CHEMBL4040507)
Kd
23±n/a nM
Citation
 Doornbos, MLJCid, JMHaubrich, JNunes, Avan de Sande, JWVermond, SCMulder-Krieger, TTrabanco, AAAhnaou, ADrinkenburg, WHLavreysen, HHeitman, LHIJzerman, APTresadern, G Discovery and Kinetic Profiling of 7-Aryl-1,2,4-triazolo[4,3-a]pyridines: Positive Allosteric Modulators of the Metabotropic Glutamate Receptor 2. J Med Chem 60:6704-6720 (2017)  
Target
Name:
Metabotropic glutamate receptor 2
Synonyms:
GPRC1B GRM2_HUMAN Metabotropic glutamate receptor mGlu2 | metabotropic glutamate 2
Type:
Enzyme
Mol. Mass.:
95584.88
Organism:
Homo sapiens (Human)
Description:
Q14416
Residue:
872
  
Inhibitor
Name:
BDBM50257560
Synonyms:
CHEMBL4085882
Type:
Small organic molecule
Emp. Form.:
C23H20ClFN4O
Mol. Mass.:
422.883
SMILES:
CCc1cc(Oc2ccc(cc2F)-c2ccn3c(CC4CC4)nnc3c2Cl)ccn1
: