Target
Acetylcholinesterase
Ligand
BDBM50008550
Substrate
Meas. Tech.
ChEMBL_29376 (CHEMBL648290)
IC50
23±n/a nM
Citation
 Cardozo, MGIimura, YSugimoto, HYamanishi, YHopfinger, AJ QSAR analyses of the substituted indanone and benzylpiperidine rings of a series of indanone-benzylpiperidine inhibitors of acetylcholinesterase. J Med Chem 35:584-9 (1992)  
Target
Name:
Acetylcholinesterase
Synonyms:
ACES_HUMAN Acetylcholinesterase (AChE) | Acetylcholinesterase (human AChE)
Type:
Enzyme
Mol. Mass.:
67792.70
Organism:
Homo sapiens (Human)
Description:
P22303
Residue:
614
  
Inhibitor
Name:
BDBM50008550
Synonyms:
6-Methyl-6,7-dihydro-indeno[5,6-d][1,3]dioxol-5-one | CHEMBL422695
Type:
Small organic molecule
Emp. Form.:
C11H10O3
Mol. Mass.:
190.1953
SMILES:
CC1Cc2cc3OCOc3cc2C1=O
: