Target
Acetylcholinesterase
Ligand
BDBM50008558
Substrate
Meas. Tech.
ChEMBL_29377 (CHEMBL648291)
IC50
5.2±n/a nM
Citation
 Cardozo, MGIimura, YSugimoto, HYamanishi, YHopfinger, AJ QSAR analyses of the substituted indanone and benzylpiperidine rings of a series of indanone-benzylpiperidine inhibitors of acetylcholinesterase. J Med Chem 35:584-9 (1992)  
Target
Name:
Acetylcholinesterase
Synonyms:
ACES_HUMAN Acetylcholinesterase (AChE) | Acetylcholinesterase (human AChE)
Type:
Enzyme
Mol. Mass.:
67792.70
Organism:
Homo sapiens (Human)
Description:
P22303
Residue:
614
  
Inhibitor
Name:
BDBM50008558
Synonyms:
CHEMBL9113 Toluol toluene
Type:
Small organic molecule
Emp. Form.:
C7H8
Mol. Mass.:
92.1384
SMILES:
Cc1ccccc1
: