Target
Neprilysin
Ligand
BDBM50008592
Substrate
Meas. Tech.
ChEBML_64516
IC50
31±n/a nM
Citation
 Mimura, TNakamura, YNishino, JSawayama, TKomiya, TDeguchi, TKita, ANakamura, HMatsumoto, J A novel class of enkephalinase inhibitors containing a C-terminal sulfo group. J Med Chem 35:602-8 (1992)  
Target
Name:
Neprilysin
Synonyms:
Mme Neprilysin Neutral endopeptidase 24.11
Type:
Protein
Mol. Mass.:
85789.59
Organism:
Rattus norvegicus (Rat)
Description:
P07861
Residue:
750
  
Inhibitor
Name:
BDBM50008592
Synonyms:
CHEMBL347040 | Sodium; 1-(2-mercaptomethyl-3-phenyl-propionylamino)-ethanesulfonate(0.75H2O)
Type:
Small organic molecule
Emp. Form.:
C12H16NO4S2
Mol. Mass.:
302.39
SMILES:
CC(NC(=O)C(CS)Cc1ccccc1)S([O-])(=O)=O
: