Target
Gastrin/cholecystokinin type B receptor
Ligand
BDBM50008634
Substrate
Meas. Tech.
ChEBML_47978
IC50
>10000±n/a nM
Citation
 Kerwin, JFWagenaar, FKopecka, HLin, CWMiller, TWitte, DStashko, MNadzan, AM Cholecystokinin antagonists: (R)-tryptophan-based hybrid antagonists of high affinity and selectivity for CCK-A receptors. J Med Chem 34:3350-9 (1992)  
Target
Name:
Gastrin/cholecystokinin type B receptor
Synonyms:
CCK-2 receptor CCK-BR CCKRB Cholecystokinin receptor GASR_HUMAN | Gastrin/cholecystokinin type B receptor
Type:
G Protein-Coupled Receptor (GPCR)
Mol. Mass.:
48445.79
Organism:
Homo sapiens (Human)
Description:
Stable expression of human CCK-2 receptors in HEK 293 cells.
Residue:
447
  
Inhibitor
Name:
BDBM50008634
Synonyms:
(S)-3,4-Dichloro-N-[1-dipentylcarbamoyl-2-(1H-indol-3-yl)-ethyl]-benzamide | CHEMBL267339
Type:
Small organic molecule
Emp. Form.:
C28H35Cl2N3O2
Mol. Mass.:
516.502
SMILES:
CCCCCN(CCCCC)C(=O)[C@H](Cc1c[nH]c2ccccc12)NC(=O)c1ccc(Cl)c(Cl)c1
: