Target
Cholecystokinin receptor type A
Ligand
BDBM50008664
Substrate
Meas. Tech.
ChEBML_49718
IC50
22000±n/a nM
Citation
 Kerwin, JFWagenaar, FKopecka, HLin, CWMiller, TWitte, DStashko, MNadzan, AM Cholecystokinin antagonists: (R)-tryptophan-based hybrid antagonists of high affinity and selectivity for CCK-A receptors. J Med Chem 34:3350-9 (1992)  
Target
Name:
Cholecystokinin receptor type A
Synonyms:
CCK-A receptor CCK1-R CCKAR_CAVPO Cholecystokinin receptor type A | Cholecystokinin-1 receptor
Type:
Mol. Mass.:
48229.77
Organism:
Cavia porcellus
Description:
Residue:
430
  
Inhibitor
Name:
BDBM50008664
Synonyms:
(R)-1N-butyl-1N-pentyl-2-(4-chlorosulfonylbenzenecarboxamido)-3-(1H-3-indolyl)-(2R)-propanamide | CHEMBL450883
Type:
Small organic molecule
Emp. Form.:
C28H36ClN3O4S
Mol. Mass.:
546.121
SMILES:
CCCCCN(CCCCC)C(=O)[C@@H](Cc1c[nH]c2ccccc12)NC(=O)S(=O)(=O)c1ccc(Cl)cc1
: