Target
Gamma-aminobutyric acid receptor subunit alpha-4/beta-3/delta
Ligand
BDBM50258252
Substrate
Meas. Tech.
ChEMBL_1690286 (CHEMBL4040856)
EC50
1355±n/a nM
Citation
 Martinez Botella, GSalituro, FGHarrison, BLBeresis, RTBai, ZBlanco, MJBelfort, GMDai, JLoya, CMAckley, MAAlthaus, ALGrossman, SJHoffmann, EDoherty, JJRobichaud, AJ Neuroactive Steroids. 2. 3?-Hydroxy-3?-methyl-21-(4-cyano-1H-pyrazol-1'-yl)-19-nor-5?-pregnan-20-one (SAGE-217): A Clinical Next Generation Neuroactive Steroid Positive Allosteric Modulator of the (?-Aminobutyric Acid) J Med Chem 60:7810-7819 (2017)  
Target
Name:
Gamma-aminobutyric acid receptor subunit alpha-4/beta-3/delta
Synonyms:
Gamma-aminobutyric acid receptor subunit alpha-4/beta3/delta
Type:
Mol. Mass.:
Description:
ASSAY_ID of ChEMBL is 1690286
Components:
This complex has 3 components.
Component 1
Name:
Gamma-aminobutyric acid receptor subunit beta-3
Synonyms:
GABA A receptor alpha-4/beta-3/gamma-2 GABA-A receptor GBRB3_HUMAN | agonist GABA site
Type:
PROTEIN
Mol. Mass.:
54130.51
Organism:
Homo sapiens (Human)
Description:
ChEMBL_448071
Residue:
473
  
Component 2
Name:
Gamma-aminobutyric acid receptor subunit alpha-4
Synonyms:
GABA A Alpha4Beta2Gamma2 GABA A Alpha4Gamma2 GABA receptor alpha-4 subunit GABRA4 Gamma-aminobutyric acid receptor subunit alpha-4
Type:
Enzyme Catalytic Domain
Mol. Mass.:
61648.70
Organism:
Homo sapiens (Human)
Description:
GABA A Alpha4Beta2Gamma2 0 HUMAN::P48169
Residue:
554
  
Component 3
Name:
Gamma-aminobutyric acid receptor subunit delta
Synonyms:
GABA(A) receptor subunit delta GBRD_HUMAN | Gamma-aminobutyric acid receptor subunit delta
Type:
PROTEIN
Mol. Mass.:
50716.35
Organism:
Homo sapiens
Description:
ChEMBL_109656
Residue:
452
  
Inhibitor
Name:
BDBM50258252
Synonyms:
CHEMBL4073679
Type:
Small organic molecule
Emp. Form.:
C25H38N2O2
Mol. Mass.:
398.5814
SMILES:
[H][C@@]12CC[C@H](C(=O)Cn3cc(C)cn3)[C@@]1(C)CC[C@@]1([H])[C@@]2([H])CC[C@]2([H])C[C@](C)(O)CC[C@]12[H]
: