Target
D(2) dopamine receptor
Ligand
BDBM50008785
Substrate
Meas. Tech.
ChEMBL_62415 (CHEMBL675740)
Ki
4.4±n/a nM
Citation
 Bishop, JEMathis, CAGerdes, JMWhitney, JMEaton, AMMailman, RB Synthesis and in vitro evaluation of 2,3-dimethoxy-5-(fluoroalkyl)-substituted benzamides: high-affinity ligands for CNS dopamine D2 receptors. J Med Chem 34:1612-24 (1991)  
Target
Name:
D(2) dopamine receptor
Synonyms:
DOPAMINE D2 DOPAMINE D2 Short Dopamine D2 receptor Drd2
Type:
G Protein-Coupled Receptor (GPCR)
Mol. Mass.:
50931.60
Organism:
Rattus norvegicus (rat)
Description:
P61169
Residue:
444
  
Inhibitor
Name:
BDBM50008785
Synonyms:
CHEMBL42953 N-(1-Ethyl-pyrrolidin-2-ylmethyl)-5-(3-fluoro-propyl)-2,3-dimethoxy-benzamide (FP-epidepride)
Type:
Small organic molecule
Emp. Form.:
C19H29FN2O3
Mol. Mass.:
352.4436
SMILES:
CCN1CCC[C@H]1CNC(=O)c1cc(CCCF)cc(OC)c1OC
: